BDBM50167010 CHEMBL193460::[3-Methyl-2-(4-methyl-piperazin-1-yl)-quinolin-4-yl]-pyrrolidin-1-yl-methanone
SMILES CN1CCN(CC1)c1nc2ccccc2c(C(=O)N2CCCC2)c1C
InChI Key InChIKey=OSGKTFURMVRNOJ-UHFFFAOYSA-N
Data  1 KI
  Tab Delimited (TSV)   2D SDfile   Computed 3D by Vconf -m prep SDfile
Find this compound or compounds like it in BindingDB:
Activity Spreadsheet -- Enzyme Inhibition Constant Data from BindingDB
Found 1 hit for monomerid = 50167010
Target5-hydroxytryptamine receptor 3A/3B(Rattus norvegicus)
Universit£
Curated by ChEMBL
LigandPNGBDBM50167010(CHEMBL193460 | [3-Methyl-2-(4-methyl-piperazin-1-y...)
Affinity DataKi:  1.60nM. Assay description: Displacement of [3H]granisetron from 5-hydroxytryptamine 3 receptor of rat cortical membrane
In DepthDetails ArticlePubMed