BDBM50167719 CHEMBL371050::[2-Chloro-6-(4-methyl-oxazol-2-ylsulfamoyl)-phenyl]-acetic acid
SMILES Cc1coc(NS(=O)(=O)c2cccc(Cl)c2CC(O)=O)n1
InChI Key InChIKey=SZAQFUBLGDHTCD-UHFFFAOYSA-N
Data  1 IC50
  Tab Delimited (TSV)   2D SDfile   Computed 3D by Vconf -m prep SDfile
Find this compound or compounds like it in BindingDB:
Activity Spreadsheet -- Enzyme Inhibition Constant Data from BindingDB
Found 1 hit for monomerid = 50167719
Target11-beta-hydroxysteroid dehydrogenase 1(Homo sapiens (Human))
Wyeth Research
Curated by ChEMBL
LigandPNGBDBM50167719(CHEMBL371050 | [2-Chloro-6-(4-methyl-oxazol-2-ylsu...)
Affinity DataIC50: >1.00E+5nM. Assay description: Inhibitory concentration against human 11-beta-hydroxysteroid dehydrogenase 1
In DepthDetails ArticlePubMed