BDBM50168099 CHEMBL3798766
SMILES COc1ccccc1Cn1cc2nc(nc(N)c2n1)-c1ccco1
InChI Key InChIKey=AQMYJLYXFKJXMD-UHFFFAOYSA-N
Data  3 KI  3 IC50
  Tab Delimited (TSV)   2D SDfile   Computed 3D by Vconf -m prep SDfile
Find this compound or compounds like it in BindingDB:
Activity Spreadsheet -- Enzyme Inhibition Constant Data from BindingDB
Found 6 hits for monomerid = 50168099
TargetAdenosine receptor A2a(Homo sapiens (Human))
Universit£
Curated by ChEMBL
LigandPNGBDBM50168099(CHEMBL3798766)
Affinity DataKi:  5.40nM. Assay description: Displacement of [3H]-ZM241385 from human adenosine A2A receptor expressed in CHO cell membranes after 60 mins by scintillation counting method
In DepthDetails ArticlePubMed
TargetAdenosine receptor A1(Homo sapiens (Human))
Universit£
Curated by ChEMBL
LigandPNGBDBM50168099(CHEMBL3798766)
Affinity DataKi:  98nM. Assay description: Displacement of [3H]-DPCPX from human adenosine A1 receptor expressed in CHO cell membranes after 120 mins by scintillation counting method
In DepthDetails ArticlePubMed
TargetAdenosine receptor A3(Homo sapiens (Human))
Universit£
Curated by ChEMBL
LigandPNGBDBM50168099(CHEMBL3798766)
Affinity DataKi:  196nM. Assay description: Displacement of [125I]-AB-MECA from human adenosine A3 receptor expressed in CHO cell membranes after 60 mins by scintillation counting method
In DepthDetails ArticlePubMed
TargetAdenosine receptor A1(Homo sapiens (Human))
Universit£
Curated by ChEMBL
LigandPNGBDBM50168099(CHEMBL3798766)
Affinity DataIC50:  106nM. Assay description: Antagonist activity at human adenosine A1 receptor expressed in CHO cell membranes assessed as suppression of CCPA-mediated inhibition of cAMP level ...
In DepthDetails ArticlePubMed
TargetAdenosine receptor A2b(Homo sapiens (Human))
Universit£
Curated by ChEMBL
LigandPNGBDBM50168099(CHEMBL3798766)
Affinity DataIC50:  512nM. Assay description: Antagonist activity at human adenosine A2B receptor expressed in CHO cell membranes assessed as inhibition of NECA-stimulated cAMP level preincubated...
In DepthDetails ArticlePubMed
TargetAdenosine receptor A2a(Homo sapiens (Human))
Universit£
Curated by ChEMBL
LigandPNGBDBM50168099(CHEMBL3798766)
Affinity DataIC50:  6.20nM. Assay description: Antagonist activity at human adenosine A2A receptor expressed in CHO cell membranes assessed as inhibition of NECA-stimulated cAMP level preincubated...
In DepthDetails ArticlePubMed