BDBM50169349 1-Cyclobutyl-6-(3,4-difluoro-phenyl)-1,3-dihydro-benzoimidazol-2-one::CHEMBL187936
SMILES Fc1ccc(cc1F)-c1ccc2[nH]c(=O)n(C3CCC3)c2c1
InChI Key InChIKey=KDVWHTAVLNNMCG-UHFFFAOYSA-N
Data  1 IC50
  Tab Delimited (TSV)   2D SDfile   Computed 3D by Vconf -m prep SDfile
Find this compound or compounds like it in BindingDB:
Activity Spreadsheet -- Enzyme Inhibition Constant Data from BindingDB
Found 1 hit for monomerid = 50169349
TargetProgesterone receptor(Homo sapiens (Human))
Wyeth Research
Curated by ChEMBL
LigandPNGBDBM50169349(1-Cyclobutyl-6-(3,4-difluoro-phenyl)-1,3-dihydro-b...)
Affinity DataIC50:  175nM. Assay description: Progesterone receptor agonist activity in human T47D breast carcinoma cell alkaline phosphatase assay
In DepthDetails ArticlePubMed