BDBM50169491 CHEMBL186149::[(S)-1-(2H-Pyrazol-3-ylaminooxalyl)-pentyl]-carbamic acid (R)-1-[5-(4-fluoro-phenyl)-[1,3,4]oxadiazol-2-ylmethyl]-2,2-dimethyl-propyl ester
SMILES CCCC[C@H](NC(=O)O[C@H](Cc1nnc(o1)-c1ccc(F)cc1)C(C)(C)C)C(=O)C(=O)Nc1ccn[nH]1
InChI Key InChIKey=QCFNLTHDXRFFKG-ZWKOTPCHSA-N
Data  5 IC50
  Tab Delimited (TSV)   2D SDfile   Computed 3D by Vconf -m prep SDfile
Find this compound or compounds like it in BindingDB:
Activity Spreadsheet -- Enzyme Inhibition Constant Data from BindingDB
Found 5 hits for monomerid = 50169491
TargetCathepsin K(Homo sapiens (Human))
Glaxosmithkline
Curated by ChEMBL
LigandPNGBDBM50169491(CHEMBL186149 | [(S)-1-(2H-Pyrazol-3-ylaminooxalyl)...)
Affinity DataIC50:  4.90E+3nM. Assay description: Inhibition of 10 lM Cbz-Phe-Arg-AMC binding to human cathepsin K in fluorescence assay with 100 mM NaOAc
In DepthDetails ArticlePubMed
TargetCathepsin S(Homo sapiens (Human))
Glaxosmithkline
Curated by ChEMBL
LigandPNGBDBM50169491(CHEMBL186149 | [(S)-1-(2H-Pyrazol-3-ylaminooxalyl)...)
Affinity DataIC50:  1.10E+5nM. Assay description: Inhibition of 10 lM Cbz-Val-Val-Arg-AMC binding to human cathepsin S in fluorescence assay with 100 mM NaOAc
In DepthDetails ArticlePubMed
TargetCathepsin B(Homo sapiens (Human))
Glaxosmithkline
Curated by ChEMBL
LigandPNGBDBM50169491(CHEMBL186149 | [(S)-1-(2H-Pyrazol-3-ylaminooxalyl)...)
Affinity DataIC50:  3.50E+6nM. Assay description: Inhibition of 10 lM Cbz-Phe-Arg-AMC binding to human cathepsin B activity in fluorescence assay with 100 mM NaOAc
In DepthDetails ArticlePubMed
TargetProcathepsin L(Homo sapiens (Human))
Glaxosmithkline
Curated by ChEMBL
LigandPNGBDBM50169491(CHEMBL186149 | [(S)-1-(2H-Pyrazol-3-ylaminooxalyl)...)
Affinity DataIC50:  3.80E+6nM. Assay description: Inhibition of 5 lM Cbz-Phe-Arg-AMC bindign to human cathepsin L activity in fluorescence assay with 100 mM NaOAc
In DepthDetails ArticlePubMed
TargetCathepsin L2(Homo sapiens (Human))
Glaxosmithkline
Curated by ChEMBL
LigandPNGBDBM50169491(CHEMBL186149 | [(S)-1-(2H-Pyrazol-3-ylaminooxalyl)...)
Affinity DataIC50:  2.30E+5nM. Assay description: Inhibition of 2 lM Cbz-Phe-Arg-AMC binding to human cathepsin V activity in fluorescence assay with 100 mM NaOAc
In DepthDetails ArticlePubMed