BDBM50169685 CHEMBL360353::N-[4-(Thiazol-2-ylcarbamoyl)-thiazol-5-yl]-malonamic acid ethyl ester
SMILES CCOC(=O)CC(=O)Nc1scnc1C(=O)Nc1nccs1
InChI Key InChIKey=OOUWLDLZLGDRQA-UHFFFAOYSA-N
Data  2 IC50
  Tab Delimited (TSV)   2D SDfile   Computed 3D by Vconf -m prep SDfile
Find this compound or compounds like it in BindingDB:
Activity Spreadsheet -- Enzyme Inhibition Constant Data from BindingDB
Found 2 hits for monomerid = 50169685
TargetMethionine aminopeptidase 1(Saccharomyces cerevisiae)
Graduate School Of The Chinese Academy Of Sciences
Curated by ChEMBL
LigandPNGBDBM50169685(CHEMBL360353 | N-[4-(Thiazol-2-ylcarbamoyl)-thiazo...)
Affinity DataIC50:  670nM. Assay description: Inhibitory concentration required against Saccharomyces cerevisiae MetAP1 (330 nM)
In DepthDetails ArticlePubMed
TargetMethionine aminopeptidase(Escherichia coli (strain K12))
Graduate School Of The Chinese Academy Of Sciences
Curated by ChEMBL
LigandPNGBDBM50169685(CHEMBL360353 | N-[4-(Thiazol-2-ylcarbamoyl)-thiazo...)
Affinity DataIC50:  66nM. Assay description: Inhibitory concentration required against Escherichia coli MetAP1 (150 nM)
In DepthDetails ArticlePubMed