BDBM50170386 CHEMBL366071::Phenyl-acetic acid 2-[4-(thiazol-2-ylcarbamoyl)-thiazol-5-yl]-ethyl ester
SMILES O=C(Cc1ccccc1)OCCc1scnc1C(=O)Nc1nccs1
InChI Key InChIKey=KNNFVOVDRZJBQG-UHFFFAOYSA-N
Data  2 IC50
  Tab Delimited (TSV)   2D SDfile   Computed 3D by Vconf -m prep SDfile
Find this compound or compounds like it in BindingDB:
Activity Spreadsheet -- Enzyme Inhibition Constant Data from BindingDB
Found 2 hits for monomerid = 50170386
TargetMethionine aminopeptidase(Escherichia coli (strain K12))
Shanghai Graduate School Of The Chinese Academy Of Sciences
Curated by ChEMBL
LigandPNGBDBM50170386(CHEMBL366071 | Phenyl-acetic acid 2-[4-(thiazol-2-...)
Affinity DataIC50:  33nM. Assay description: Inhibitory concentration against EcMetAP1 enzyme activity
In DepthDetails ArticlePubMed
TargetMethionine aminopeptidase 1(Saccharomyces cerevisiae)
Shanghai Graduate School Of The Chinese Academy Of Sciences
Curated by ChEMBL
LigandPNGBDBM50170386(CHEMBL366071 | Phenyl-acetic acid 2-[4-(thiazol-2-...)
Affinity DataIC50:  6.04E+3nM. Assay description: Inhibitory concentration against ScMetAP1 enzyme activity
In DepthDetails ArticlePubMed