BDBM50170569 (2-Amino-4,5,6,7-tetrahydro-benzo[b]thiophen-3-yl)-(3,4,5-trimethoxy-phenyl)-methanone::CHEMBL362315
SMILES COc1cc(cc(OC)c1OC)C(=O)c1c(N)sc2CCCCc12
InChI Key InChIKey=UFCXZXHZPWSXTE-UHFFFAOYSA-N
Data  1 IC50
  Tab Delimited (TSV)   2D SDfile   Computed 3D by Vconf -m prep SDfile
Find this compound or compounds like it in BindingDB:
Activity Spreadsheet -- Enzyme Inhibition Constant Data from BindingDB
Found 1 hit for monomerid = 50170569
TargetTubulin beta chain [1-43](Leishmania donovani)
Universitá
Curated by ChEMBL
LigandPNGBDBM50170569((2-Amino-4,5,6,7-tetrahydro-benzo[b]thiophen-3-yl)...)
Affinity DataIC50: >4.00E+4nM. Assay description: Concentration required to inhibit tubulin polymerization at 10 uM
In DepthDetails ArticlePubMed