BDBM50170572 (2-Amino-benzo[b]thiophen-3-yl)-(3,4,5-trimethoxy-phenyl)-methanone::(2-amino-benzo[b]thiophen-3-yl)-(3,4,5-trimethoxyphenyl)-methanone::(2-aminobenzo[b]thiophen-3-yl)(3,4,5-trimethoxyphenyl)methanone::CHEMBL189355
SMILES COc1cc(cc(OC)c1OC)C(=O)c1c(N)sc2ccccc12
InChI Key InChIKey=JQEVJXXMFRRASE-UHFFFAOYSA-N
Data  1 IC50
  Tab Delimited (TSV)   2D SDfile   Computed 3D by Vconf -m prep SDfile
Find this compound or compounds like it in BindingDB:
Activity Spreadsheet -- Enzyme Inhibition Constant Data from BindingDB
Found 1 hit for monomerid = 50170572
TargetTubulin beta chain [1-43](Leishmania donovani)
Universitá
Curated by ChEMBL
LigandPNGBDBM50170572((2-Amino-benzo[b]thiophen-3-yl)-(3,4,5-trimethoxy-...)
Affinity DataIC50:  3.10E+3nM. Assay description: Concentration required to inhibit tubulin polymerization at 10 uM
In DepthDetails ArticlePubMed