BDBM50171894 4-{2-[4-(3-Chloro-phenyl)-piperazin-1-yl]-ethoxy}-4-aza-tricyclo[5.2.1.0*2,6*]dec-8-ene-3,5-dione::CHEMBL362999
SMILES Clc1cccc(c1)N1CCN(CCON2C(=O)C3C4CC(C=C4)C3C2=O)CC1
InChI Key InChIKey=KQONSXLQFOLHMD-UHFFFAOYSA-N
Data  3 KI
  Tab Delimited (TSV)   2D SDfile   Computed 3D by Vconf -m prep SDfile
Find this compound or compounds like it in BindingDB:
Activity Spreadsheet -- Enzyme Inhibition Constant Data from BindingDB
Found 3 hits for monomerid = 50171894
Target5-hydroxytryptamine receptor 1A(Rattus norvegicus (rat))
Università
Curated by ChEMBL
LigandPNGBDBM50171894(4-{2-[4-(3-Chloro-phenyl)-piperazin-1-yl]-ethoxy}-...)
Affinity DataKi:  27.1nM. Assay description: Inhibition of [3H]-8-OH-DPAT binding to Serotonin 5-HT1A receptor from rat brain cortex
In DepthDetails ArticlePubMed
Target5-hydroxytryptamine receptor 2A(Rattus norvegicus (rat))
Università
Curated by ChEMBL
LigandPNGBDBM50171894(4-{2-[4-(3-Chloro-phenyl)-piperazin-1-yl]-ethoxy}-...)
Affinity DataKi:  2.70E+3nM. Assay description: Inhibition of 0.4 nM [3H]-ketanserin binding to Serotonin 5-HT2A receptor from rat brain cortex
In DepthDetails ArticlePubMed
Target5-hydroxytryptamine receptor 2C(Rattus norvegicus (Rat))
Università
Curated by ChEMBL
LigandPNGBDBM50171894(4-{2-[4-(3-Chloro-phenyl)-piperazin-1-yl]-ethoxy}-...)
Affinity DataKi: >1.00E+5nM. Assay description: Inhibition of 1 nM [3H]-mesulergine binding to Serotonin 5-HT2C receptor from rat brain cortex
In DepthDetails ArticlePubMed