BDBM50172566 CHEMBL196291::N-{4-[3-(4-tert-Butyl-benzyl)-thioureidomethyl]-2-iodo-phenyl}-methanesulfonamide
SMILES CC(C)(C)c1ccc(CNC(=S)NCc2ccc(NS(C)(=O)=O)c(I)c2)cc1
InChI Key InChIKey=AQOPVSHGLTWPDV-UHFFFAOYSA-N
Data  1 IC50
  Tab Delimited (TSV)   2D SDfile   Computed 3D by Vconf -m prep SDfile
Find this compound or compounds like it in BindingDB:
Activity Spreadsheet -- Enzyme Inhibition Constant Data from BindingDB
Found 1 hit for monomerid = 50172566
TargetTransient receptor potential cation channel subfamily V member 1(Rattus norvegicus (rat))
Seoul National University
Curated by ChEMBL
LigandPNGBDBM50172566(CHEMBL196291 | N-{4-[3-(4-tert-Butyl-benzyl)-thiou...)
Affinity DataIC50:  41nM. Assay description: Inhibitory effect on capsaicin (0.5 uM)-induced calcium uptake in rat DRG neurons upon incubation at RT for 10 minutes
In DepthDetails ArticlePubMed