BDBM50173356 1-(4-tert-Butyl-phenyl)-5-(4-chloro-1H-pyrrol-2-yloxy)-3-(3-trifluoromethyl-phenoxy)-1H-indole-2-carboxylic acid::CHEMBL199244
SMILES CC(C)(C)c1ccc(cc1)-n1c(C(O)=O)c(Oc2cccc(c2)C(F)(F)F)c2cc(Oc3cc(Cl)c[nH]3)ccc12
InChI Key InChIKey=UVCGQEKYMUYURA-UHFFFAOYSA-N
Data  2 IC50  1 EC50
  Tab Delimited (TSV)   2D SDfile   Computed 3D by Vconf -m prep SDfile
Find this compound or compounds like it in BindingDB:
Activity Spreadsheet -- Enzyme Inhibition Constant Data from BindingDB
Found 3 hits for monomerid = 50173356
TargetPeroxisome proliferator-activated receptor alpha(Homo sapiens (Human))
Merck Research Laboratories
Curated by ChEMBL
LigandPNGBDBM50173356(1-(4-tert-Butyl-phenyl)-5-(4-chloro-1H-pyrrol-2-yl...)
Affinity DataIC50: >1.50E+4nM. Assay description: Inhibitory concentration against human peroxisome proliferator activated receptor alpha in SPA assay
In DepthDetails ArticlePubMed
TargetPeroxisome proliferator-activated receptor gamma(Homo sapiens (Human))
Merck Research Laboratories
Curated by ChEMBL
LigandPNGBDBM50173356(1-(4-tert-Butyl-phenyl)-5-(4-chloro-1H-pyrrol-2-yl...)
Affinity DataEC50:  2nM. Assay description: Effective agonist concentration for human PPAR gamma Gal4 construct in transactivation assay
In DepthDetails ArticlePubMed
TargetPeroxisome proliferator-activated receptor gamma(Homo sapiens (Human))
Merck Research Laboratories
Curated by ChEMBL
LigandPNGBDBM50173356(1-(4-tert-Butyl-phenyl)-5-(4-chloro-1H-pyrrol-2-yl...)
Affinity DataIC50:  2nM. Assay description: Inhibitory concentration against human peroxisome proliferator activated receptor gamma in SPA assay
In DepthDetails ArticlePubMed