BDBM50174900 CHEMBL197281::N-(1-(3-methoxybenzyl)piperidin-4-yl)-5-chloro-1H-indazol-3-amine
SMILES COc1cccc(CN2CCC(CC2)Nc2[nH]nc3ccc(Cl)cc23)c1
InChI Key InChIKey=RCYSBANHYUZXBM-UHFFFAOYSA-N
Data  2 IC50
  Tab Delimited (TSV)   2D SDfile   Computed 3D by Vconf -m prep SDfile
Find this compound or compounds like it in BindingDB:
Activity Spreadsheet -- Enzyme Inhibition Constant Data from BindingDB
Found 2 hits for monomerid = 50174900
TargetMelanin-concentrating hormone receptor 1(Homo sapiens (Human))
Abbott Laboratories
Curated by ChEMBL
LigandPNGBDBM50174900(CHEMBL197281 | N-(1-(3-methoxybenzyl)piperidin-4-y...)
Affinity DataIC50:  150nM. Assay description: Binding affinity to human MCHr1 from neuronal IMR32 cells
In DepthDetails ArticlePubMed
TargetMelanin-concentrating hormone receptor 1(Homo sapiens (Human))
Abbott Laboratories
Curated by ChEMBL
LigandPNGBDBM50174900(CHEMBL197281 | N-(1-(3-methoxybenzyl)piperidin-4-y...)
Affinity DataIC50:  4.50E+3nM. Assay description: Functional antagonism of MCH-mediated calcium release by FLIPR using human MCHr1 from neuronal IMR32 cells
In DepthDetails ArticlePubMed