BDBM50174906 (3-(1-(benzo[d][1,3]dioxol-5-ylmethyl)piperidin-4-ylamino)-5-chloro-1H-indazol-1-yl)(pyridin-3-yl)methanone::CHEMBL369986
SMILES Clc1ccc2n(nc(NC3CCN(Cc4ccc5OCOc5c4)CC3)c2c1)C(=O)c1cccnc1
InChI Key InChIKey=MNCBMBGKEPQQPH-UHFFFAOYSA-N
Data  2 IC50
  Tab Delimited (TSV)   2D SDfile   Computed 3D by Vconf -m prep SDfile
Find this compound or compounds like it in BindingDB:
Activity Spreadsheet -- Enzyme Inhibition Constant Data from BindingDB
Found 2 hits for monomerid = 50174906
TargetMelanin-concentrating hormone receptor 1(Homo sapiens (Human))
Abbott Laboratories
Curated by ChEMBL
LigandPNGBDBM50174906((3-(1-(benzo[d][1,3]dioxol-5-ylmethyl)piperidin-4-...)
Affinity DataIC50:  930nM. Assay description: Functional antagonism of MCH-mediated calcium release by FLIPR using human MCHr1 from neuronal IMR32 cells
In DepthDetails ArticlePubMed
TargetMelanin-concentrating hormone receptor 1(Homo sapiens (Human))
Abbott Laboratories
Curated by ChEMBL
LigandPNGBDBM50174906((3-(1-(benzo[d][1,3]dioxol-5-ylmethyl)piperidin-4-...)
Affinity DataIC50:  20nM. Assay description: Binding affinity to human MCHr1 from neuronal IMR32 cells
In DepthDetails ArticlePubMed