BDBM50174916 5-chloro-N-(1-(naphthalen-2-ylmethyl)piperidin-4-yl)-1-(pyridin-2-ylmethyl)-1H-indazol-3-amine::CHEMBL372848
SMILES Clc1ccc2n(Cc3ccccn3)nc(NC3CCN(Cc4ccc5ccccc5c4)CC3)c2c1
InChI Key InChIKey=SJRILSZPAVZTBJ-UHFFFAOYSA-N
Data  2 IC50
  Tab Delimited (TSV)   2D SDfile   Computed 3D by Vconf -m prep SDfile
Find this compound or compounds like it in BindingDB:
Activity Spreadsheet -- Enzyme Inhibition Constant Data from BindingDB
Found 2 hits for monomerid = 50174916
TargetMelanin-concentrating hormone receptor 1(Homo sapiens (Human))
Abbott Laboratories
Curated by ChEMBL
LigandPNGBDBM50174916(5-chloro-N-(1-(naphthalen-2-ylmethyl)piperidin-4-y...)
Affinity DataIC50:  20nM. Assay description: Binding affinity to human MCHr1 from neuronal IMR32 cells
In DepthDetails ArticlePubMed
TargetMelanin-concentrating hormone receptor 1(Homo sapiens (Human))
Abbott Laboratories
Curated by ChEMBL
LigandPNGBDBM50174916(5-chloro-N-(1-(naphthalen-2-ylmethyl)piperidin-4-y...)
Affinity DataIC50:  640nM. Assay description: Functional antagonism of MCH-mediated calcium release by FLIPR using human MCHr1 from neuronal IMR32 cells
In DepthDetails ArticlePubMed