BDBM50174974 CHEMBL3809900
SMILES Cc1nn(-c2ccccc2)c2nc(CNc3ccc(C)cc3)[nH]c(=O)c12
InChI Key InChIKey=CNIGNUKXCCTKGQ-UHFFFAOYSA-N
Data  3 IC50
  Tab Delimited (TSV)   2D SDfile   Computed 3D by Vconf -m prep SDfile
Find this compound or compounds like it in BindingDB:
Activity Spreadsheet -- Enzyme Inhibition Constant Data from BindingDB
Found 3 hits for monomerid = 50174974
TargetCyclin-dependent kinase/G2/mitotic-specific cyclin- 1(Homo sapiens (Human))
Beni-Suef University
Curated by ChEMBL
LigandPNGBDBM50174974(CHEMBL3809900)
Affinity DataIC50: >2.50E+4nM. Assay description: Inhibition of CDK1/Cyclin B (unknown origin)
In DepthDetails ArticlePubMed
TargetTyrosine-protein kinase ABL1(Homo sapiens (Human))
Beni-Suef University
Curated by ChEMBL
LigandPNGBDBM50174974(CHEMBL3809900)
Affinity DataIC50: >2.50E+4nM. Assay description: Inhibition of Abl (unknown origin)
In DepthDetails ArticlePubMed
TargetCyclin-dependent kinase 2/G1/S-specific cyclin-E1(Homo sapiens (Human))
Beni-Suef University
Curated by ChEMBL
LigandPNGBDBM50174974(CHEMBL3809900)
Affinity DataIC50:  4.60E+3nM. Assay description: Inhibition of CDK2/Cyclin E (unknown origin)
In DepthDetails ArticlePubMed