BDBM50174975 CHEMBL3808727
SMILES Cc1nn(-c2ccccc2)c2nc(CNc3ccc(O)cc3)[nH]c(=O)c12
InChI Key InChIKey=QYZFRWNAPRKQJC-UHFFFAOYSA-N
Data  3 IC50
  Tab Delimited (TSV)   2D SDfile   Computed 3D by Vconf -m prep SDfile
Find this compound or compounds like it in BindingDB:
Activity Spreadsheet -- Enzyme Inhibition Constant Data from BindingDB
Found 3 hits for monomerid = 50174975
TargetCyclin-dependent kinase/G2/mitotic-specific cyclin- 1(Homo sapiens (Human))
Beni-Suef University
Curated by ChEMBL
LigandPNGBDBM50174975(CHEMBL3808727)
Affinity DataIC50:  1.70E+4nM. Assay description: Inhibition of CDK1/Cyclin B (unknown origin)
In DepthDetails ArticlePubMed
TargetTyrosine-protein kinase ABL1(Homo sapiens (Human))
Beni-Suef University
Curated by ChEMBL
LigandPNGBDBM50174975(CHEMBL3808727)
Affinity DataIC50: >1.00E+5nM. Assay description: Inhibition of Abl (unknown origin)
In DepthDetails ArticlePubMed
TargetCyclin-dependent kinase 2/G1/S-specific cyclin-E1(Homo sapiens (Human))
Beni-Suef University
Curated by ChEMBL
LigandPNGBDBM50174975(CHEMBL3808727)
Affinity DataIC50:  2.00E+3nM. Assay description: Inhibition of CDK2/Cyclin E (unknown origin)
In DepthDetails ArticlePubMed