BDBM50176314 CHEMBL201328::N-(3-fluorobenzyl)quinolin-2-amine
SMILES Fc1cccc(CNc2ccc3ccccc3n2)c1
InChI Key InChIKey=SNFGJWATQBWRSV-UHFFFAOYSA-N
Data  1 Kd
  Tab Delimited (TSV)   2D SDfile   Computed 3D by Vconf -m prep SDfile
Find this compound or compounds like it in BindingDB:
Activity Spreadsheet -- Enzyme Inhibition Constant Data from BindingDB
Found 1 hit for monomerid = 50176314
TargetTyrosine-protein kinase Tec(Homo sapiens (Human))
The University Of Adelaide
Curated by ChEMBL
LigandPNGBDBM50176314(CHEMBL201328 | N-(3-fluorobenzyl)quinolin-2-amine)
Affinity DataKd:  1.77E+5nM. Assay description: Binding affinity to Tec SH3 domain
In DepthDetails ArticlePubMed