BDBM50176713 (R)-3-(3-methoxyquinuclidin-3-yl)-1,1-dip-tolylprop-2-yn-1-ol::CHEMBL200209
SMILES CO[C@@]1(CN2CCC1CC2)C#CC(O)(c1ccc(C)cc1)c1ccc(C)cc1
InChI Key InChIKey=MMMQUSWLVGQDBX-XMMPIXPASA-N
Data  2 KI
  Tab Delimited (TSV)   2D SDfile   Computed 3D by Vconf -m prep SDfile
Find this compound or compounds like it in BindingDB:
Activity Spreadsheet -- Enzyme Inhibition Constant Data from BindingDB
Found 2 hits for monomerid = 50176713
TargetMuscarinic acetylcholine receptor M3(Homo sapiens (Human))
Ucb Pharma
Curated by ChEMBL
LigandPNGBDBM50176713((R)-3-(3-methoxyquinuclidin-3-yl)-1,1-dip-tolylpro...)
Affinity DataKi:  100nM. Assay description: Binding affinity to human muscarinic M3 receptor
In DepthDetails ArticlePubMed
TargetMuscarinic acetylcholine receptor M2(Homo sapiens (Human))
Ucb Pharma
Curated by ChEMBL
LigandPNGBDBM50176713((R)-3-(3-methoxyquinuclidin-3-yl)-1,1-dip-tolylpro...)
Affinity DataKi:  501nM. Assay description: Binding affinity to human muscarinic M2 receptor
In DepthDetails ArticlePubMed