BDBM50177035 CHEMBL3814774
SMILES Cc1nn(c2CCc3cnc(N)nc3-c12)-c1ccccc1
InChI Key InChIKey=VQILVKOCDACKCV-UHFFFAOYSA-N
Data  1 IC50
  Tab Delimited (TSV)   2D SDfile   Computed 3D by Vconf -m prep SDfile
Find this compound or compounds like it in BindingDB:
Activity Spreadsheet -- Enzyme Inhibition Constant Data from BindingDB
Found 1 hit for monomerid = 50177035
LigandPNGBDBM50177035(CHEMBL3814774)
Affinity DataIC50:  8.13E+3nM. Assay description: Inhibition of human full length recombinant His-tagged PIK3CD/PIK3R1 expressed in baculovirus expression system after 60 mins by LanthaScreen Eu bind...
In DepthDetails ArticlePubMed