BDBM50178003 CHEMBL370011::N-cyclopropyl-2-(5-phenyl-7-(5-deoxy-beta-D-ribofuranosyl)-pyrrolo[2,3-d]pyrimidin-4-ylamino)ethanethioa
SMILES C[C@H]1O[C@H]([C@H](O)[C@@H]1O)n1cc(-c2ccccc2)c2c(NCC(=S)NC3CC3)ncnc12
InChI Key InChIKey=OXXAVGJMFFWKDE-XHLLGHLISA-N
Data  1 IC50
  Tab Delimited (TSV)   2D SDfile   Computed 3D by Vconf -m prep SDfile
Find this compound or compounds like it in BindingDB:
Activity Spreadsheet -- Enzyme Inhibition Constant Data from BindingDB
Found 1 hit for monomerid = 50178003
TargetAdenosine kinase(Homo sapiens (Human))
Metabasis Therapeutics
Curated by ChEMBL
LigandPNGBDBM50178003(CHEMBL370011 | N-cyclopropyl-2-(5-phenyl-7-(5-deox...)
Affinity DataIC50:  0.5nM. Assay description: Inhibitory activity against recombinant human adenosine kinase
In DepthDetails ArticlePubMed