BDBM50178047 8-furan-2-yl-2-morpholin-4-ylchromen-4-one::CHEMBL369990
SMILES O=c1cc(oc2c(cccc12)-c1ccco1)N1CCOCC1
InChI Key InChIKey=KEXLPFOPRBRYIA-UHFFFAOYSA-N
Data  1 IC50
  Tab Delimited (TSV)   2D SDfile   Computed 3D by Vconf -m prep SDfile
Find this compound or compounds like it in BindingDB:
Activity Spreadsheet -- Enzyme Inhibition Constant Data from BindingDB
Found 1 hit for monomerid = 50178047
TargetDNA-dependent protein kinase catalytic subunit(Homo sapiens (Human))
School Of Natural Sciences--Chemistry
Curated by ChEMBL
LigandPNGBDBM50178047(8-furan-2-yl-2-morpholin-4-ylchromen-4-one | CHEMB...)
Affinity DataIC50:  2.80E+3nM. Assay description: Inhibitory activity against DNA-dependent protein kinase receptor
In DepthDetails ArticlePubMed