BDBM50178120 2-morpholinobenzo[h]quinolin-4(1H)-one::CHEMBL198675
SMILES [OH+]=c1cc(nc2c3ccccc3ccn12)N1CCOCC1
InChI Key InChIKey=BVRDQVRQVGRNHG-UHFFFAOYSA-O
Data  1 IC50
  Tab Delimited (TSV)   2D SDfile   Computed 3D by Vconf -m prep SDfile
Find this compound or compounds like it in BindingDB:
Activity Spreadsheet -- Enzyme Inhibition Constant Data from BindingDB
Found 1 hit for monomerid = 50178120
TargetDNA-dependent protein kinase catalytic subunit(Homo sapiens (Human))
School Of Natural Sciences--Chemistry
Curated by ChEMBL
LigandPNGBDBM50178120(2-morpholinobenzo[h]quinolin-4(1H)-one | CHEMBL198...)
Affinity DataIC50:  250nM. Assay description: Inhibitory activity against DNA-dependent protein kinase receptor
In DepthDetails ArticlePubMed