BDBM50178147 (S)-1-(2-amino-2-carboxyethyl)-3-(2-carboxyethyl)-5-nitropyrimidine-2,4-dione::CHEMBL380805
SMILES N[C@@H](Cn1cc([N+]([O-])=O)c(=O)n(CCC(O)=O)c1=O)C(O)=O
InChI Key InChIKey=USLMBZUHALNLAG-YFKPBYRVSA-N
Data  1 KI
  Tab Delimited (TSV)   2D SDfile   Computed 3D by Vconf -m prep SDfile
Find this compound or compounds like it in BindingDB:
Activity Spreadsheet -- Enzyme Inhibition Constant Data from BindingDB
Found 1 hit for monomerid = 50178147
TargetGlutamate receptor ionotropic, kainate 2(Rattus norvegicus)
University Walk
Curated by ChEMBL
LigandPNGBDBM50178147((S)-1-(2-amino-2-carboxyethyl)-3-(2-carboxyethyl)-...)
Affinity DataKi: >1.00E+5nM. Assay description: Displacement of [3H]kainate from rat GLUK6 receptor expressed in HEK293 cells
In DepthDetails ArticlePubMed