BDBM50178220 CHEMBL3814550::US10206931, Example 57
SMILES C[C@@H]1CC(=O)Nc2cccc(-c3ccc4n(C)nc(C5CC5)c4c3)c2N1
InChI Key InChIKey=RUOHSEWJRWMCPQ-GFCCVEGCSA-N
Data  4 IC50  1 EC50
PDB links: 1 PDB ID matches this monomer.
  Tab Delimited (TSV)   2D SDfile   Computed 3D by Vconf -m prep SDfile
Find this compound or compounds like it in BindingDB:
Activity Spreadsheet -- Enzyme Inhibition Constant Data from BindingDB
Found 4 hits for monomerid = 50178220
TargetBromodomain-containing protein 4(Homo sapiens (Human))
Constellation Pharmaceuticals
Curated by ChEMBL
LigandPNGBDBM50178220(CHEMBL3814550 | US10206931, Example 57)
Affinity DataIC50:  8.90E+3nM. Assay description: Displacement of biotinylated ligand from recombinant His-tagged BRD4 bromodomain-1 (unknown origin) incubated for 10 mins by TR-FRET assay
In DepthDetails ArticlePubMed
TargetBromodomain-containing protein 4 [42-168](Homo sapiens (Human))
Genentech
US Patent
LigandPNGBDBM50178220(CHEMBL3814550 | US10206931, Example 57)
Affinity DataIC50:  4.03E+3nM. Assay description: His/Flag epitope tagged BRD4 BD142-168 was cloned, expressed, and purified to. BRD4 binding and inhibition was assessed by monitoring the engagement ...
In DepthDetails US Patent
TargetCREB-binding protein(Homo sapiens (Human))
Constellation Pharmaceuticals
Curated by ChEMBL
LigandPNGBDBM50178220(CHEMBL3814550 | US10206931, Example 57)
Affinity DataIC50:  49nM. Assay description: His/Flag epitope tagged CBP was cloned, expressed, and purified to homogeneity. CBP binding and inhibition was assessed by monitoring the engagement ...
TargetCREB-binding protein(Homo sapiens (Human))
Constellation Pharmaceuticals
Curated by ChEMBL
LigandPNGBDBM50178220(CHEMBL3814550 | US10206931, Example 57)
Affinity DataIC50:  33nM. Assay description: Displacement of biotinylated ligand from recombinant His-tagged CBP (unknown origin) incubated for 10 mins by TR-FRET assay