BDBM50178888 9-cyclopropyl-7-(2,6-dimethylpyridin-3-yl)-6-fluoroisothiazolo[5,4-b]quinoline-3,4(2H,9H)-dione::CHEMBL204749
SMILES Cc1ccc(c(C)n1)-c1cc2n(C3CC3)c3s[nH]c(=O)c3c(=O)c2cc1F
InChI Key InChIKey=RJJIYFJFDDWEDG-UHFFFAOYSA-N
Data  1 IC50
  Tab Delimited (TSV)   2D SDfile   Computed 3D by Vconf -m prep SDfile
Find this compound or compounds like it in BindingDB:
Activity Spreadsheet -- Enzyme Inhibition Constant Data from BindingDB
Found 1 hit for monomerid = 50178888
TargetDNA topoisomerase 4 subunit A(Staphylococcus aureus)
Achillion Pharmaceuticals
Curated by ChEMBL
LigandPNGBDBM50178888(9-cyclopropyl-7-(2,6-dimethylpyridin-3-yl)-6-fluor...)
Affinity DataIC50:  8.00E+3nM. Assay description: Inhibitory activity against Staphylococcus aureus ATCC 29213 wild type Topo 4
In DepthDetails ArticlePubMed