BDBM50178898 9-cyclopropyl-6-fluoro-7-(6-methoxypyridin-3-yl)isothiazolo[5,4-b]quinoline-3,4(2H,9H)-dione::CHEMBL437129
SMILES COc1ccc(cn1)-c1cc2n(C3CC3)c3s[nH]c(=O)c3c(=O)c2cc1F
InChI Key InChIKey=WHEVUBHJWLRKRR-UHFFFAOYSA-N
Data  1 IC50
  Tab Delimited (TSV)   2D SDfile   Computed 3D by Vconf -m prep SDfile
Find this compound or compounds like it in BindingDB:
Activity Spreadsheet -- Enzyme Inhibition Constant Data from BindingDB
Found 1 hit for monomerid = 50178898
TargetDNA topoisomerase 4 subunit A(Staphylococcus aureus)
Achillion Pharmaceuticals
Curated by ChEMBL
LigandPNGBDBM50178898(9-cyclopropyl-6-fluoro-7-(6-methoxypyridin-3-yl)is...)
Affinity DataIC50:  2.60E+4nM. Assay description: Inhibitory activity against Staphylococcus aureus ATCC 29213 wild type Topo 4
In DepthDetails ArticlePubMed