BDBM50178908 9-cyclopropyl-6-fluoro-7-(5-methylpyridin-2-yl)isothiazolo[5,4-b]quinoline-3,4(2H,9H)-dione::CHEMBL378608
SMILES Cc1ccc(nc1)-c1cc2n(C3CC3)c3s[nH]c(=O)c3c(=O)c2cc1F
InChI Key InChIKey=YCKPHBNFZOGCBJ-UHFFFAOYSA-N
Data  1 IC50
  Tab Delimited (TSV)   2D SDfile   Computed 3D by Vconf -m prep SDfile
Find this compound or compounds like it in BindingDB:
Activity Spreadsheet -- Enzyme Inhibition Constant Data from BindingDB
Found 1 hit for monomerid = 50178908
TargetDNA topoisomerase 4 subunit A(Staphylococcus aureus)
Achillion Pharmaceuticals
Curated by ChEMBL
LigandPNGBDBM50178908(9-cyclopropyl-6-fluoro-7-(5-methylpyridin-2-yl)iso...)
Affinity DataIC50:  1.40E+4nM. Assay description: Inhibitory activity against Staphylococcus aureus ATCC 29213 wild type Topo 4
In DepthDetails ArticlePubMed