BDBM50179345 (2-chloro-6H-thieno[2,3-b]pyrrol-5-yl)(4-methylpiperazin-1-yl)methanone::CHEMBL364400
SMILES CN1CCN(CC1)C(=O)c1cc2cc(Cl)sc2[nH]1
InChI Key InChIKey=CLCJTVGIGUHUDD-UHFFFAOYSA-N
Data  1 KI
  Tab Delimited (TSV)   2D SDfile   Computed 3D by Vconf -m prep SDfile
Find this compound or compounds like it in BindingDB:
Activity Spreadsheet -- Enzyme Inhibition Constant Data from BindingDB
Found 1 hit for monomerid = 50179345
TargetHistamine H4 receptor(Homo sapiens (Human))
Johnson & Johnson Pharmaceutical Research And Development
Curated by ChEMBL
LigandPNGBDBM50179345((2-chloro-6H-thieno[2,3-b]pyrrol-5-yl)(4-methylpip...)
Affinity DataKi:  25nM. Assay description: Displacement of [3H]histamine from recombinant human histamine H4 receptor in SK-N-MC cells
In DepthDetails ArticlePubMed