BDBM50179351 (2-chloro-3-methyl-4H-thieno[3,2-b]pyrrol-5-yl)(4-methylpiperazin-1-yl)methanone::CHEMBL199062
SMILES CN1CCN(CC1)C(=O)c1cc2sc(Cl)c(C)c2[nH]1
InChI Key InChIKey=FHTHHGGIWNDYIW-UHFFFAOYSA-N
Data  1 KI
  Tab Delimited (TSV)   2D SDfile   Computed 3D by Vconf -m prep SDfile
Find this compound or compounds like it in BindingDB:
Activity Spreadsheet -- Enzyme Inhibition Constant Data from BindingDB
Found 1 hit for monomerid = 50179351
TargetHistamine H4 receptor(Homo sapiens (Human))
Johnson & Johnson Pharmaceutical Research And Development
Curated by ChEMBL
LigandPNGBDBM50179351((2-chloro-3-methyl-4H-thieno[3,2-b]pyrrol-5-yl)(4-...)
Affinity DataKi:  3nM. Assay description: Displacement of [3H]histamine from recombinant human histamine H4 receptor in SK-N-MC cells
In DepthDetails ArticlePubMed