BDBM50179864 3-cyano-N-(4-(1,1,1,3,3,3-hexafluoro-2-hydroxypropan-2-yl)phenyl)-N-methylbenzenesulfonamide::CHEMBL206626
SMILES CN(c1ccc(cc1)C(O)(C(F)(F)F)C(F)(F)F)S(=O)(=O)c1cccc(c1)C#N
InChI Key InChIKey=HPKCKUJJQFHPLT-UHFFFAOYSA-N
Data  1 EC50
  Tab Delimited (TSV)   2D SDfile   Computed 3D by Vconf -m prep SDfile
Find this compound or compounds like it in BindingDB:
Activity Spreadsheet -- Enzyme Inhibition Constant Data from BindingDB
Found 1 hit for monomerid = 50179864
TargetOxysterols receptor LXR-alpha(Homo sapiens (Human))
Amgen
Curated by ChEMBL
LigandPNGBDBM50179864(3-cyano-N-(4-(1,1,1,3,3,3-hexafluoro-2-hydroxyprop...)
Affinity DataEC50:  20nM. Assay description: Activity against LXR alpha transiently transfected in HEK293 cells
In DepthDetails ArticlePubMed