BDBM50181252 3-(3-(1H-imidazol-1-yl)propyl)-1-(4-(methylthiomethyl)benzyl)-5-methyl-5-(naphthalen-1-yl)imidazolidine-2,4-dione::CHEMBL205973
SMILES CSCc1ccc(CN2C(=O)N(CCCn3ccnc3)C(=O)C2(C)c2cccc3ccccc23)cc1
InChI Key InChIKey=FOAZKKVMCXADMU-UHFFFAOYSA-N
Data  1 IC50
  Tab Delimited (TSV)   2D SDfile   Computed 3D by Vconf -m prep SDfile
Find this compound or compounds like it in BindingDB:
Activity Spreadsheet -- Enzyme Inhibition Constant Data from BindingDB
Found 1 hit for monomerid = 50181252
TargetDimer of Protein farnesyltransferase subunit beta(Homo sapiens (Human))
Keimyung University
Curated by ChEMBL
LigandPNGBDBM50181252(3-(3-(1H-imidazol-1-yl)propyl)-1-(4-(methylthiomet...)
Affinity DataIC50:  0.210nM. Assay description: Inhibition of farnesyl transferase
In DepthDetails ArticlePubMed