BDBM50181283 4-(3-(2-(3-hydroxy-4-phenylbutyl)-5-oxopyrrolidin-1-yl)propyl)benzoic acid::CHEMBL427035
SMILES OC(CCC1CCC(=O)N1CCCc1ccc(cc1)C(O)=O)Cc1ccccc1
InChI Key InChIKey=DQLDMXGXNPDHDY-UHFFFAOYSA-N
Data  4 IC50
  Tab Delimited (TSV)   2D SDfile   Computed 3D by Vconf -m prep SDfile
Find this compound or compounds like it in BindingDB:
Activity Spreadsheet -- Enzyme Inhibition Constant Data from BindingDB
Found 4 hits for monomerid = 50181283
TargetProstaglandin E2 receptor EP1 subtype(Homo sapiens (Human))
Pfizer
Curated by ChEMBL
LigandPNGBDBM50181283(4-(3-(2-(3-hydroxy-4-phenylbutyl)-5-oxopyrrolidin-...)
Affinity DataIC50: >3.20E+3nM. Assay description: Binding affinity to human EP1 receptor expressed in HEK293 cells
In DepthDetails ArticlePubMed
TargetProstaglandin E2 receptor EP3 subtype(Homo sapiens (Human))
Pfizer
Curated by ChEMBL
LigandPNGBDBM50181283(4-(3-(2-(3-hydroxy-4-phenylbutyl)-5-oxopyrrolidin-...)
Affinity DataIC50: >3.20E+3nM. Assay description: Binding affinity to human EP3 receptor expressed in HEK293 cells
In DepthDetails ArticlePubMed
TargetProstaglandin E2 receptor EP2 subtype(Rattus norvegicus)
Pfizer
Curated by ChEMBL
LigandPNGBDBM50181283(4-(3-(2-(3-hydroxy-4-phenylbutyl)-5-oxopyrrolidin-...)
Affinity DataIC50: >3.20E+3nM. Assay description: Binding affinity to rat EP2 receptor expressed in HEK293 cells
In DepthDetails ArticlePubMed
TargetProstaglandin E2 receptor EP4 subtype(Rattus norvegicus)
Pfizer
Curated by ChEMBL
LigandPNGBDBM50181283(4-(3-(2-(3-hydroxy-4-phenylbutyl)-5-oxopyrrolidin-...)
Affinity DataIC50:  250nM. Assay description: Binding affinity to rat EP4 receptor expressed in HEK293 cells
In DepthDetails ArticlePubMed