BDBM50181493 4-[3-(3-benzyloxy-pyridin-2-yl)-ureido]-benzenesulfonamide::CHEMBL373254
SMILES NS(=O)(=O)c1ccc(NC(=O)Nc2ncccc2OCc2ccccc2)cc1
InChI Key InChIKey=YBZHDQYLQLICSJ-UHFFFAOYSA-N
Data  1 IC50
  Tab Delimited (TSV)   2D SDfile   Computed 3D by Vconf -m prep SDfile
Find this compound or compounds like it in BindingDB:
Activity Spreadsheet -- Enzyme Inhibition Constant Data from BindingDB
Found 1 hit for monomerid = 50181493
TargetPeptidyl-prolyl cis-trans isomerase A(Homo sapiens (Human))
University Of Montpellier
Curated by ChEMBL
LigandPNGBDBM50181493(4-[3-(3-benzyloxy-pyridin-2-yl)-ureido]-benzenesul...)
Affinity DataIC50:  60nM. Assay description: Inhibition of isomerase activity of Cyclophilin A
In DepthDetails ArticlePubMed