BDBM50182357 (2-(4-fluorophenyl)-3-(2-methoxypyrimidin-4-yl)H-imidazo[1,2-a]pyridin-7-yl)-N,N-dimethylmethanamine::CHEMBL379463
SMILES COc1nccc(n1)-c1c(nc2cc(CN(C)C)ccn12)-c1ccc(F)cc1
InChI Key InChIKey=DHHNOGVSFWQJFY-UHFFFAOYSA-N
Data  1 IC50
  Tab Delimited (TSV)   2D SDfile   Computed 3D by Vconf -m prep SDfile
Find this compound or compounds like it in BindingDB:
Activity Spreadsheet -- Enzyme Inhibition Constant Data from BindingDB
Found 1 hit for monomerid = 50182357
TargetcGMP-dependent protein kinase(Eimeria tenella)
Merck Research Laboratories
Curated by ChEMBL
LigandPNGBDBM50182357((2-(4-fluorophenyl)-3-(2-methoxypyrimidin-4-yl)H-i...)
Affinity DataIC50:  2.60nM. Assay description: Inhibitory activity against PKG
In DepthDetails ArticlePubMed