BDBM50182821 4-(3,4-difluorophenylthio)-2-(pyridin-2-yl)pyrimidine::CHEMBL380422
SMILES Fc1ccc(Sc2ccnc(n2)-c2ccccn2)cc1F
InChI Key InChIKey=SBFACNJRXPIVQP-UHFFFAOYSA-N
Data  1 IC50
  Tab Delimited (TSV)   2D SDfile   Computed 3D by Vconf -m prep SDfile
Find this compound or compounds like it in BindingDB:
Activity Spreadsheet -- Enzyme Inhibition Constant Data from BindingDB
Found 1 hit for monomerid = 50182821
TargetMetabotropic glutamate receptor 5(Homo sapiens (Human))
Nps Pharmaceuticals
Curated by ChEMBL
LigandPNGBDBM50182821(4-(3,4-difluorophenylthio)-2-(pyridin-2-yl)pyrimid...)
Affinity DataIC50:  1.52E+3nM. Assay description: Inhibition of glutamate-induced calcium influx in human mGluR5d by FLIPR
In DepthDetails ArticlePubMed