BDBM50183663 4-(4-chlorobenzyl)-2-tert-butylphthalazin-1(2H)-one::CHEMBL207058
SMILES CC(C)(C)n1nc(Cc2ccc(Cl)cc2)c2ccccc2c1=O
InChI Key InChIKey=YJWIGZVFCPCRCG-UHFFFAOYSA-N
Data  1 EC50
  Tab Delimited (TSV)   2D SDfile   Computed 3D by Vconf -m prep SDfile
Find this compound or compounds like it in BindingDB:
Activity Spreadsheet -- Enzyme Inhibition Constant Data from BindingDB
Found 1 hit for monomerid = 50183663
TargetAlpha-1D adrenergic receptor(Rattus norvegicus (Rat))
Universidad De Salamanca
Curated by ChEMBL
LigandPNGBDBM50183663(4-(4-chlorobenzyl)-2-tert-butylphthalazin-1(2H)-on...)
Affinity DataEC50: >1.00E+5nM. Assay description: Vasorelaxation of phenylephrine-stimulated Wistar rat aorta contraction
In DepthDetails ArticlePubMed