BDBM50183667 4-(3,4-dimethoxybenzyl)-2-ethylphthalazin-1(2H)-one::CHEMBL207325
SMILES CCn1nc(Cc2ccc(OC)c(OC)c2)c2ccccc2c1=O
InChI Key InChIKey=DYIYBSGPWFNAHB-UHFFFAOYSA-N
Data  1 EC50
  Tab Delimited (TSV)   2D SDfile   Computed 3D by Vconf -m prep SDfile
Find this compound or compounds like it in BindingDB:
Activity Spreadsheet -- Enzyme Inhibition Constant Data from BindingDB
Found 1 hit for monomerid = 50183667
TargetAlpha-1D adrenergic receptor(Rattus norvegicus (Rat))
Universidad De Salamanca
Curated by ChEMBL
LigandPNGBDBM50183667(4-(3,4-dimethoxybenzyl)-2-ethylphthalazin-1(2H)-on...)
Affinity DataEC50:  5.30E+3nM. Assay description: Vasorelaxation of phenylephrine-stimulated Wistar rat aorta contraction
In DepthDetails ArticlePubMed