BDBM50183669 4-(4-(methylthio)benzyl)-2-methylphthalazin-1(2H)-one::CHEMBL206101
SMILES CSc1ccc(Cc2nn(C)c(=O)c3ccccc23)cc1
InChI Key InChIKey=SFUJLLSOFDUHEJ-UHFFFAOYSA-N
Data  1 EC50
  Tab Delimited (TSV)   2D SDfile   Computed 3D by Vconf -m prep SDfile
Find this compound or compounds like it in BindingDB:
Activity Spreadsheet -- Enzyme Inhibition Constant Data from BindingDB
Found 1 hit for monomerid = 50183669
TargetAlpha-1D adrenergic receptor(Rattus norvegicus (Rat))
Universidad De Salamanca
Curated by ChEMBL
LigandPNGBDBM50183669(4-(4-(methylthio)benzyl)-2-methylphthalazin-1(2H)-...)
Affinity DataEC50:  930nM. Assay description: Vasorelaxation of phenylephrine-stimulated Wistar rat aorta contraction
In DepthDetails ArticlePubMed