BDBM50183676 4-(3,4-dimethoxybenzyl)-2-tert-butylphthalazin-1(2H)-one::CHEMBL207846
SMILES COc1ccc(Cc2nn(c(=O)c3ccccc23)C(C)(C)C)cc1OC
InChI Key InChIKey=HQXANOZMSSCSDV-UHFFFAOYSA-N
Data  1 EC50
  Tab Delimited (TSV)   2D SDfile   Computed 3D by Vconf -m prep SDfile
Find this compound or compounds like it in BindingDB:
Activity Spreadsheet -- Enzyme Inhibition Constant Data from BindingDB
Found 1 hit for monomerid = 50183676
TargetAlpha-1D adrenergic receptor(Rattus norvegicus (Rat))
Universidad De Salamanca
Curated by ChEMBL
LigandPNGBDBM50183676(4-(3,4-dimethoxybenzyl)-2-tert-butylphthalazin-1(2...)
Affinity DataEC50:  1.00E+4nM. Assay description: Vasorelaxation of phenylephrine-stimulated Wistar rat aorta contraction
In DepthDetails ArticlePubMed