BDBM50183681 4-(4-(methylthio)benzyl)-2-tert-butylphthalazin-1(2H)-one::CHEMBL208068
SMILES CSc1ccc(Cc2nn(c(=O)c3ccccc23)C(C)(C)C)cc1
InChI Key InChIKey=ZIWXBECYJZEIKT-UHFFFAOYSA-N
Data  1 EC50
  Tab Delimited (TSV)   2D SDfile   Computed 3D by Vconf -m prep SDfile
Find this compound or compounds like it in BindingDB:
Activity Spreadsheet -- Enzyme Inhibition Constant Data from BindingDB
Found 1 hit for monomerid = 50183681
TargetAlpha-1D adrenergic receptor(Rattus norvegicus (Rat))
Universidad De Salamanca
Curated by ChEMBL
LigandPNGBDBM50183681(4-(4-(methylthio)benzyl)-2-tert-butylphthalazin-1(...)
Affinity DataEC50: >1.00E+5nM. Assay description: Vasorelaxation of phenylephrine-stimulated Wistar rat aorta contraction
In DepthDetails ArticlePubMed