BDBM50184579 2-(7-(4-(2-methoxyphenyl)piperazin-1-yl)heptyl)-4-p-tolylphthalazin-1(2H)-one::CHEMBL206837
SMILES COc1ccccc1N1CCN(CCCCCCCn2nc(-c3ccc(C)cc3)c3ccccc3c2=O)CC1
InChI Key InChIKey=VEHMQZMSSPFGRO-UHFFFAOYSA-N
Data  1 KI
  Tab Delimited (TSV)   2D SDfile   Computed 3D by Vconf -m prep SDfile
Find this compound or compounds like it in BindingDB:
Activity Spreadsheet -- Enzyme Inhibition Constant Data from BindingDB
Found 1 hit for monomerid = 50184579
Target5-hydroxytryptamine receptor 1A(Rattus norvegicus (rat))
Università
Curated by ChEMBL
LigandPNGBDBM50184579(2-(7-(4-(2-methoxyphenyl)piperazin-1-yl)heptyl)-4-...)
Affinity DataKi:  101nM. Assay description: Displacement of [3H]8-OH-DPAT from 5HT1A serotoninergic receptor in rat cerebral cortex
In DepthDetails ArticlePubMed