BDBM50184589 (3aS,6aS)-1-(4-(2,5-dichlorophenyl)pyrimidin-2-yl)-octahydropyrrolo[3,4-b]pyrrole::CHEMBL379983
SMILES Clc1ccc(Cl)c(c1)-c1ccnc(n1)N1CC[C@H]2CNC[C@@H]12
InChI Key InChIKey=XBEWJIQFUPIVJK-ZUZCIYMTSA-N
Data  1 EC50
  Tab Delimited (TSV)   2D SDfile   Computed 3D by Vconf -m prep SDfile
Find this compound or compounds like it in BindingDB:
Activity Spreadsheet -- Enzyme Inhibition Constant Data from BindingDB
Found 1 hit for monomerid = 50184589
Target5-hydroxytryptamine receptor 2C(Homo sapiens (Human))
Athersys
Curated by ChEMBL
LigandPNGBDBM50184589((3aS,6aS)-1-(4-(2,5-dichlorophenyl)pyrimidin-2-yl)...)
Affinity DataEC50: >1.00E+3nM. Assay description: Induction of 5HT2C receptor mediated increase in intracellular calcium concentration in HEK293 cells
In DepthDetails ArticlePubMed