BDBM50184814 CHEMBL207842::ethyl 4-(1H-indol-5-yloxy)-5-methylpyrrolo[2,1-f][1,2,4]triazine-6-carboxylate
SMILES CCOC(=O)c1cn2ncnc(Oc3ccc4[nH]ccc4c3)c2c1C
InChI Key InChIKey=GJBVLGAEYZMOLC-UHFFFAOYSA-N
Data  1 IC50
  Tab Delimited (TSV)   2D SDfile   Computed 3D by Vconf -m prep SDfile
Find this compound or compounds like it in BindingDB:
Activity Spreadsheet -- Enzyme Inhibition Constant Data from BindingDB
Found 1 hit for monomerid = 50184814
TargetVascular endothelial growth factor receptor 2(Homo sapiens (Human))
Pharmaceutical Research Institute
Curated by ChEMBL
LigandPNGBDBM50184814(CHEMBL207842 | ethyl 4-(1H-indol-5-yloxy)-5-methyl...)
Affinity DataIC50:  87nM. Assay description: Inhibitory activity against VEGFR2
In DepthDetails ArticlePubMed