BDBM50184821 CHEMBL206545::N-(3-(4-(4-fluoro-2-methyl-1H-indol-5-yloxy)-5-methylpyrrolo[2,1-f][1,2,4]triazin-6-yloxy)propyl)methanesulfonamide
SMILES Cc1cc2c(F)c(Oc3ncnn4cc(OCCCNS(C)(=O)=O)c(C)c34)ccc2[nH]1
InChI Key InChIKey=SJTJWXRSXLQPEW-UHFFFAOYSA-N
Data  2 IC50
  Tab Delimited (TSV)   2D SDfile   Computed 3D by Vconf -m prep SDfile
Find this compound or compounds like it in BindingDB:
Activity Spreadsheet -- Enzyme Inhibition Constant Data from BindingDB
Found 2 hits for monomerid = 50184821
TargetVascular endothelial growth factor receptor 2(Homo sapiens (Human))
Pharmaceutical Research Institute
Curated by ChEMBL
LigandPNGBDBM50184821(CHEMBL206545 | N-(3-(4-(4-fluoro-2-methyl-1H-indol...)
Affinity DataIC50:  66nM. Assay description: Inhibitory activity against VEGFR2
In DepthDetails ArticlePubMed
TargetCytochrome P450 3A4(Homo sapiens (Human))
Pharmaceutical Research Institute
Curated by ChEMBL
LigandPNGBDBM50184821(CHEMBL206545 | N-(3-(4-(4-fluoro-2-methyl-1H-indol...)
Affinity DataIC50:  1.00E+3nM. Assay description: Inhibitory activity against CYP3A4
In DepthDetails ArticlePubMed