BDBM50185269 CHEMBL203629::N-(furan-3-ylmethyl)-2-(5-nitro-1H-indol-3-yl)-2-oxoacetamide
SMILES [O-][N+](=O)c1ccc2[nH]cc(C(=O)C(=O)NCc3ccoc3)c2c1
InChI Key InChIKey=OGFUWLSWHJYFLK-UHFFFAOYSA-N
Data  2 KI
  Tab Delimited (TSV)   2D SDfile   Computed 3D by Vconf -m prep SDfile
Find this compound or compounds like it in BindingDB:
Activity Spreadsheet -- Enzyme Inhibition Constant Data from BindingDB
Found 2 hits for monomerid = 50185269
TargetGamma-aminobutyric acid receptor subunit alpha-1/beta-2/gamma-2(Rattus norvegicus (Rat))
Universit£
Curated by ChEMBL
LigandPNGBDBM50185269(CHEMBL203629 | N-(furan-3-ylmethyl)-2-(5-nitro-1H-...)
Affinity DataKi:  56.6nM. Assay description: Displacement of [3H]flumazenil from rat GABA-Aalpha1 receptor plus beta-2-gamma-2 in HEK293 cells
In DepthDetails ArticlePubMed
TargetGamma-aminobutyric acid receptor subunit alpha-2/beta-2/gamma-2(Rattus norvegicus (Rat))
Universit£
Curated by ChEMBL
LigandPNGBDBM50185269(CHEMBL203629 | N-(furan-3-ylmethyl)-2-(5-nitro-1H-...)
Affinity DataKi:  236nM. Assay description: Displacement of [3H]flumazenil from rat GABA-Aalpha2 receptor plus beta-2-gamma-2 in HEK293 cells
In DepthDetails ArticlePubMed