BDBM50186798 CHEMBL378180::N-(4-chloro-3-trifluoromethyl-phenyl)-2-[4-(3'-cyano-biphenyl-4-yl)-1-cyclopentyl-piperidin-4-ylamino]-acetamide
SMILES FC(F)(F)c1cc(NC(=O)CNC2(CCN(CC2)C2CCCC2)c2ccc(cc2)-c2cccc(c2)C#N)ccc1Cl
InChI Key InChIKey=CMJMDFJQANEZRN-UHFFFAOYSA-N
Data  2 KI
  Tab Delimited (TSV)   2D SDfile   Computed 3D by Vconf -m prep SDfile
Find this compound or compounds like it in BindingDB:
Activity Spreadsheet -- Enzyme Inhibition Constant Data from BindingDB
Found 2 hits for monomerid = 50186798
TargetMelanin-concentrating hormone receptor 1(Homo sapiens (Human))
Schering-Plough Research Institute
Curated by ChEMBL
LigandPNGBDBM50186798(CHEMBL378180 | N-(4-chloro-3-trifluoromethyl-pheny...)
Affinity DataKi:  23nM. Assay description: Binding affinity at human MCHR1 assessed as inhibition of MCH-mediated calcium ion influx by FLIPR assay
In DepthDetails ArticlePubMed
TargetMelanin-concentrating hormone receptor 2(Homo sapiens (Human))
Schering-Plough Research Institute
Curated by ChEMBL
LigandPNGBDBM50186798(CHEMBL378180 | N-(4-chloro-3-trifluoromethyl-pheny...)
Affinity DataKi: >3.00E+3nM. Assay description: Binding affinity at human MCHR2 assessed as inhibition of MCH-mediated calcium ion influx by FLIPR assay
In DepthDetails ArticlePubMed