BDBM50187634 CHEMBL379553::N-(2-phenylimidazo[1,2-a]pyridin-3-yl)benzamide
SMILES O=C(Nc1c(nc2ccccn12)-c1ccccc1)c1ccccc1
InChI Key InChIKey=MFEAOWRPVOQOEV-UHFFFAOYSA-N
Data  1 KI
  Tab Delimited (TSV)   2D SDfile   Computed 3D by Vconf -m prep SDfile
Find this compound or compounds like it in BindingDB:
Activity Spreadsheet -- Enzyme Inhibition Constant Data from BindingDB
Found 1 hit for monomerid = 50187634
TargetMetabotropic glutamate receptor 5(Rattus norvegicus (Rat))
Vanderbilt University School Of Medicine
Curated by ChEMBL
LigandPNGBDBM50187634(CHEMBL379553 | N-(2-phenylimidazo[1,2-a]pyridin-3-...)
Affinity DataKi:  3.92E+3nM. Assay description: Displacement of [3H]methoxyPEPy from rat mGluR5 expressed in HEK293 cells
In DepthDetails ArticlePubMed