BDBM50187697 CHEMBL3828278
SMILES O[C@H](c1ccccn1)C1(CCC1)c1ccc(Cl)c(Cl)c1
InChI Key InChIKey=HIKORRABWGGUPU-OAHLLOKOSA-N
Data  1 IC50
  Tab Delimited (TSV)   2D SDfile   Computed 3D by Vconf -m prep SDfile
Find this compound or compounds like it in BindingDB:
Activity Spreadsheet -- Enzyme Inhibition Constant Data from BindingDB
Found 1 hit for monomerid = 50187697
LigandPNGBDBM50187697(CHEMBL3828278)
Affinity DataIC50:  160nM. Assay description: Antagonist activity at human TRPV3 expressed in recombinant HEK293 cells assessed as inhibition of 2-APB induced calcium flux by FLIPR analysis
In DepthDetails ArticlePubMed