BDBM50187945 CHEMBL379543::rac-9a-butyl-6-cyclopropyl-8,9,9a,10-tetrahydroindeno[2,1-e]indazol-7(3H)-one
SMILES CCCCC12Cc3c(ccc4[nH]ncc34)C1=C(C1CC1)C(=O)CC2
InChI Key InChIKey=PBKRGGSLHOYZBI-UHFFFAOYSA-N
Data  2 IC50
  Tab Delimited (TSV)   2D SDfile   Computed 3D by Vconf -m prep SDfile
Find this compound or compounds like it in BindingDB:
Activity Spreadsheet -- Enzyme Inhibition Constant Data from BindingDB
Found 2 hits for monomerid = 50187945
TargetEstrogen receptor beta(Homo sapiens (Human))
Merck Research Laboratories
Curated by ChEMBL
LigandPNGBDBM50187945(CHEMBL379543 | rac-9a-butyl-6-cyclopropyl-8,9,9a,1...)
Affinity DataIC50:  7nM. Assay description: Binding affinity to human ERbeta
In DepthDetails ArticlePubMed
TargetEstrogen receptor(Homo sapiens (Human))
Merck Research Laboratories
Curated by ChEMBL
LigandPNGBDBM50187945(CHEMBL379543 | rac-9a-butyl-6-cyclopropyl-8,9,9a,1...)
Affinity DataIC50:  422nM. Assay description: Binding affinity to human ERalpha
In DepthDetails ArticlePubMed